Target
Sodium-dependent dopamine transporter
Ligand
BDBM50132678
Substrate
Meas. Tech.
ChEMBL_62950 (CHEMBL675534)
Ki
72±n/a nM
Citation
 Axford, LBoot, JRHotten, TMKeenan, MMartin, FMMilutinovic, SMoore, NAO'Neill, MFPullar, IATupper, DEVan Belle, KRVivien, V Bicyclo[2.2.1]heptanes as novel triple re-uptake inhibitors for the treatment of depression. Bioorg Med Chem Lett 13:3277-80 (2003)  
Target
Name:
Sodium-dependent dopamine transporter
Synonyms:
DA transporter DAT1 Dopamine transporter protein (DAT) SC6A3_HUMAN Sodium-dependent dopamine transporter Solute carrier family 6 member 3
Type:
Multi-pass membrane protein
Mol. Mass.:
68497.11
Organism:
Homo sapiens (Human)
Description:
Q01959
Residue:
620
  
Inhibitor
Name:
BDBM50132678
Synonyms:
CHEMBL432022 | [(2S,3S)-3-(6-Fluoro-naphthalen-2-yl)-bicyclo[2.2.1]hept-2-ylmethyl]-methyl-amine
Type:
Small organic molecule
Emp. Form.:
C19H22FN
Mol. Mass.:
283.3831
SMILES:
CNC[C@H]1C2CCC(C2)[C@@H]1c1ccc2cc(F)ccc2c1
: