Target
Transthyretin
Ligand
BDBM67454
Substrate
Meas. Tech.
ChEMBL_2105310 (CHEMBL4813813)
IC50
12000±n/a nM
Citation
 Kitakami, RInui, KNakagawa, YSawai, YKatayama, WYokoyama, TOkada, TKanamitsu, KNakagawa, SToyooka, NMizuguchi, M Inhibitory activities of anthraquinone and xanthone derivatives against transthyretin amyloidogenesis. Bioorg Med Chem 44:0 (2021)  
Target
Name:
Transthyretin
Synonyms:
ATTR Prealbumin TTHY_HUMAN Transthyretin (TTR)
Type:
Enzyme
Mol. Mass.:
15884.31
Organism:
Homo sapiens (Human)
Description:
P02766
Residue:
147
  
Inhibitor
Name:
BDBM67454
Synonyms:
1,2,4-trihydroxy-9,10-anthraquinone 1,2,4-tris(oxidanyl)anthracene-9,10-dione SMR001306802 hsp90_173 | purpurin
Type:
Small organic molecule
Emp. Form.:
C14H8O5
Mol. Mass.:
256.2103
SMILES:
Oc1cc(O)c2C(=O)c3ccccc3C(=O)c2c1O
: