Target
Lanosterol synthase
Ligand
BDBM50133285
Substrate
Meas. Tech.
ChEMBL_148889 (CHEMBL758670)
IC50
4.6±n/a nM
Citation
 Hinshaw, JCSuh, DYGarnier, PBuckner, FSEastman, RTMatsuda, SPJoubert, BMCoppens, IJoiner, KAMerali, SNash, TEPrestwich, GD Oxidosqualene cyclase inhibitors as antimicrobial agents. J Med Chem 46:4240-3 (2003)  
Target
Name:
Lanosterol synthase
Synonyms:
2,3-epoxysqualene--lanosterol cyclase LSS_HUMAN Oxidosqualene--lanosterol cyclase
Type:
PROTEIN
Mol. Mass.:
83309.32
Organism:
Homo sapiens (Human)
Description:
ChEMBL_11231
Residue:
732
  
Inhibitor
Name:
BDBM50133285
Synonyms:
(E)-3-Carboxy-acrylateallyl-{6-[4-(4-chloro-benzoyl)-phenoxy]-hexyl}-methyl-ammonium; | CHEMBL135109
Type:
Small organic molecule
Emp. Form.:
C23H28ClFNO2
Mol. Mass.:
404.925
SMILES:
C[NH+](CCCCCCOc1ccc(C(=O)c2ccc(Cl)cc2)c(F)c1)CC=C
: