Target
REST corepressor 1
Ligand
BDBM50346863
Substrate
Meas. Tech.
ChEMBL_2105723 (CHEMBL4814398)
Ki
1100±n/a nM
Citation
 Dai, XJLiu, YXiong, XPXue, LPZheng, YCLiu, HM Tranylcypromine Based Lysine-Specific Demethylase 1 Inhibitor: Summary and Perspective. J Med Chem 63:14197-14215 (2020)  
Target
Name:
REST corepressor 1
Synonyms:
KIAA0071 RCOR RCOR1_HUMAN | REST corepressor 1
Type:
PROTEIN
Mol. Mass.:
53329.34
Organism:
Homo sapiens (Human)
Description:
ChEMBL_108118
Residue:
485
  
Inhibitor
Name:
BDBM50346863
Synonyms:
CHEMBL1797640 | US8765820, 5b
Type:
Small organic molecule
Emp. Form.:
C16H16N2O
Mol. Mass.:
252.311
SMILES:
NC1CC1c1ccc(NC(=O)c2ccccc2)cc1
: