Target
Mu-type opioid receptor
Ligand
BDBM50568638
Substrate
Meas. Tech.
ChEMBL_2106122 (CHEMBL4814797)
Ki
316±n/a nM
Citation
 Creed, SMGutridge, AMArgade, MDHennessy, MRFriesen, JBPauli, GFvan Rijn, RMRiley, AP Isolation and Pharmacological Characterization of Six Opioidergic  J Nat Prod 84:71-80 (2021)  
Target
Name:
Mu-type opioid receptor
Synonyms:
M-OR-1 MOR-1 MUOR1 Mu opiate receptor OPRM1 hMOP | mu-type opioid receptor isoform MOR-1
Type:
G Protein-Coupled Receptor (GPCR)
Mol. Mass.:
44789.51
Organism:
Homo sapiens (Human)
Description:
P35372
Residue:
400
  
Inhibitor
Name:
BDBM50568638
Synonyms:
CHEMBL4871880
Type:
Small organic molecule
Emp. Form.:
C22H26N2O4
Mol. Mass.:
382.4528
SMILES:
[H][C@@]12C[C@@]3([H])C(CN1CC[C@@]14c5cc(O)ccc5N(C)[C@@]21OC[C@]34C(=O)OC)=CC
: