Target
Kappa-type opioid receptor
Ligand
BDBM50000296
Substrate
Meas. Tech.
ChEMBL_2106123 (CHEMBL4814798)
Ki
0.094000±n/a nM
Citation
 Creed, SMGutridge, AMArgade, MDHennessy, MRFriesen, JBPauli, GFvan Rijn, RMRiley, AP Isolation and Pharmacological Characterization of Six Opioidergic  J Nat Prod 84:71-80 (2021)  
Target
Name:
Kappa-type opioid receptor
Synonyms:
K-OR-1 Kappa-opioid receptor (KOR) Kappa-type opioid receptor (KOR) OPIATE Kappa OPRK1 kappa opioid receptor (KOR)
Type:
G Protein-Coupled Receptor (GPCR)
Mol. Mass.:
42648.76
Organism:
Homo sapiens (Human)
Description:
P41145
Residue:
380
  
Inhibitor
Name:
BDBM50000296
Synonyms:
CHEMBL441765 U-50488H | US11492374, ID 1
Type:
Small organic molecule
Emp. Form.:
C19H26Cl2N2O
Mol. Mass.:
369.329
SMILES:
CN([C@@H]1CCCC[C@H]1N1CCCC1)C(=O)Cc1ccc(Cl)c(Cl)c1
: