Target
Nucleotide-binding oligomerization domain-containing protein 2
Ligand
BDBM50568929
Substrate
Meas. Tech.
ChEMBL_2107055 (CHEMBL4815730)
IC50
5.0±n/a nM
Citation
 Nikhar, SSiokas, ISchlicher, LLee, SGyrd-Hansen, MDegterev, ACuny, GD Design of pyrido[2,3-d]pyrimidin-7-one inhibitors of receptor interacting protein kinase-2 (RIPK2) and nucleotide-binding oligomerization domain (NOD) cell signaling. Eur J Med Chem 215:0 (2021)  
Target
Name:
Nucleotide-binding oligomerization domain-containing protein 2
Synonyms:
CARD15 IBD1 NOD2 Nucleotide-binding oligomerization domain-containing protein 2 | nucleotide-binding oligomerization domain containing 2
Type:
PROTEIN
Mol. Mass.:
115287.18
Organism:
Homo sapiens (Human)
Description:
ChEMBL_1454053
Residue:
1040
  
Inhibitor
Name:
BDBM50568929
Synonyms:
CHEMBL4870434
Type:
Small organic molecule
Emp. Form.:
C26H29N5O3
Mol. Mass.:
459.5402
SMILES:
CCN(CC)CCOc1ccc(Nc2ncc3cc(-c4ccc(O)cc4)c(=O)n(C)c3n2)cc1
: