Target
Ectonucleotide pyrophosphatase/phosphodiesterase family member 3
Ligand
BDBM50569247
Substrate
Meas. Tech.
ChEMBL_2108586 (CHEMBL4817261)
IC50
210±n/a nM
Citation
 Ullah, SEl-Gamal, MIEl-Gamal, RPelletier, JSévigny, JShehata, MKAnbar, HSIqbal, J Synthesis, biological evaluation, and docking studies of novel pyrrolo[2,3-b]pyridine derivatives as both ectonucleotide pyrophosphatase/phosphodiesterase inhibitors and antiproliferative agents. Eur J Med Chem 217:0 (2021)  
Target
Name:
Ectonucleotide pyrophosphatase/phosphodiesterase family member 3
Synonyms:
Alkaline phosphodiesterase I E-NPP 3 ENPP3_HUMAN NPPase PD-Ibeta Phosphodiesterase I beta | Phosphodiesterase I/nucleotide pyrophosphatase 3
Type:
PROTEIN
Mol. Mass.:
100124.29
Organism:
Homo sapiens (Human)
Description:
ChEMBL_101240
Residue:
875
  
Inhibitor
Name:
BDBM50569247
Synonyms:
CHEMBL4859945
Type:
Small organic molecule
Emp. Form.:
C27H20ClN5OS
Mol. Mass.:
497.999
SMILES:
Oc1ccc(cc1Cl)-c1nn(cc1-c1ccncc1)-c1cccc(NC(=S)Nc2ccccc2)c1
: