Target
Broad substrate specificity ATP-binding cassette transporter ABCG2
Ligand
BDBM50029739
Substrate
Meas. Tech.
ChEMBL_2110746 (CHEMBL4819596)
Ki
323±n/a nM
Citation
 Guragossian, NBelhani, BMoreno, ANunes, MTGonzalez-Lobato, LMarminon, CBerthier, LRocio Andrade Pires, ADÖzvegy-Laczka, CSarkadi, BTerreux, RBouaziz, ZBerredjem, MJose, JDi Pietro, AFalson, PLe Borgne, M Uncompetitive nanomolar dimeric indenoindole inhibitors of the human breast cancer resistance pump ABCG2. Eur J Med Chem 211:0 (2021)  
Target
Name:
Broad substrate specificity ATP-binding cassette transporter ABCG2
Synonyms:
ABCG2 ABCP ATP-binding cassette sub-family G member 2 ATP-binding cassette, sub-family G, member 2 BCRP1 CDw338 Mitoxantrone resistance-associated protein Urate exporter
Type:
Multi-pass membrane protein; monomer or homodimer; disulfide-linked
Mol. Mass.:
72329.48
Organism:
Homo sapiens (Human)
Description:
Q9UNQ0
Residue:
655
  
Inhibitor
Name:
BDBM50029739
Synonyms:
CHEMBL3353414
Type:
Small organic molecule
Emp. Form.:
C24H21NO2
Mol. Mass.:
355.429
SMILES:
CC1Cc2c(c3C(=O)c4ccccc4-c3n2CCc2ccccc2)C(=O)C1
: