Target
P2Y purinoceptor 1
Ligand
BDBM50409762
Substrate
Meas. Tech.
ChEMBL_147583 (CHEMBL750161)
Ki
91±n/a nM
Citation
 Kim, HSOhno, MXu, BKim, HOChoi, YJi, XDMaddileti, SMarquez, VEHarden, TKJacobson, KA 2-Substitution of adenine nucleotide analogues containing a bicyclo[3.1.0]hexane ring system locked in a northern conformation: enhanced potency as P2Y1 receptor antagonists. J Med Chem 46:4974-87 (2003)  
Target
Name:
P2Y purinoceptor 1
Synonyms:
ATP receptor P2RY1_HUMAN P2Y1 Purinergic receptor P2Y1
Type:
Enzyme
Mol. Mass.:
42090.25
Organism:
Homo sapiens (Human)
Description:
P47900
Residue:
373
  
Inhibitor
Name:
BDBM50409762
Synonyms:
CHEMBL2112865
Type:
Small organic molecule
Emp. Form.:
C14H21N5O8P2S
Mol. Mass.:
481.358
SMILES:
CNc1nc(SC)nc2n(cnc12)[C@H]1C[C@H](OP(O)(O)=O)[C@]2(COP(O)(O)=O)C[C@H]12
: