Target
Adenosylhomocysteinase
Ligand
BDBM50135289
Substrate
Meas. Tech.
ChEMBL_196714 (CHEMBL803317)
IC50
13000±n/a nM
Citation
 Kitade, YKojima, HZulfiqur, FKim, HSWataya, Y Synthesis of 2-fluoronoraristeromycin and its inhibitory activity against Plasmodium falciparum S-adenosyl-L-homocysteine hydrolase. Bioorg Med Chem Lett 13:3963-5 (2003)  
Target
Name:
Adenosylhomocysteinase
Synonyms:
AdoHcyase S-adenosyl-L-homocysteine hydrolase | SAHH_PLAF7
Type:
PROTEIN
Mol. Mass.:
53833.80
Organism:
Plasmodium falciparum 3D7
Description:
ChEMBL_196715
Residue:
479
  
Inhibitor
Name:
BDBM50135289
Synonyms:
(1S,2R,3S,4R)-4-(6-Amino-2-fluoro-purin-9-yl)-cyclopentane-1,2,3-triol 2-fluoronoraristeromycin | CHEMBL129469
Type:
Small organic molecule
Emp. Form.:
C10H12FN5O3
Mol. Mass.:
269.2324
SMILES:
Nc1nc(F)nc2n(cnc12)[C@@H]1C[C@H](O)[C@@H](O)[C@H]1O
: