Target
Mitogen-activated protein kinase 11
Ligand
BDBM50135312
Substrate
Meas. Tech.
ChEBML_124653
IC50
57±n/a nM
Citation
 Liu, LStelmach, JENatarajan, SRChen, MHSingh, SBSchwartz, CDFitzgerald, CEO'Keefe, SJZaller, DMSchmatz, DMDoherty, JB SAR of 3,4-dihydropyrido[3,2-d]pyrimidone p38 inhibitors. Bioorg Med Chem Lett 13:3979-82 (2003)  
Target
Name:
Mitogen-activated protein kinase 11
Synonyms:
MAP kinase p38 MK11_HUMAN Mitogen-activated protein kinase p38 beta SAPK2 Stress-activated protein kinase 2 p38-2 p38b
Type:
Enzyme Catalytic Domain
Mol. Mass.:
41351.73
Organism:
Homo sapiens (Human)
Description:
gi_20128774
Residue:
364
  
Inhibitor
Name:
BDBM50135312
Synonyms:
6-(2-Chloro-4-fluoro-phenylsulfanyl)-1-(2,6-dichloro-phenyl)-3,4-dihydro-1H-pyrido[3,2-d]pyrimidin-2-one | CHEMBL128813
Type:
Small organic molecule
Emp. Form.:
C19H11Cl3FN3OS
Mol. Mass.:
454.733
SMILES:
Fc1ccc(Sc2ccc3N(C(=O)NCc3n2)c2c(Cl)cccc2Cl)c(Cl)c1
: