Target
Retinoic acid receptor beta
Ligand
BDBM50135463
Substrate
Meas. Tech.
ChEBML_195468
Ki
2612±n/a nM
Citation
 Michellys, PYBoehm, MFChen, JHGrese, TAKaranewsky, DSLeibowitz, MDLiu, SMais, DAMapes, CMReifel-Miller, AOgilvie, KMRungta, DThompson, AWTyhonas, JSYumibe, NArdecky, RJ Design and synthesis of novel RXR-selective modulators with improved pharmacological profile. Bioorg Med Chem Lett 13:4071-5 (2003)  
Target
Name:
Retinoic acid receptor beta
Synonyms:
HAP NR1B2 RAR-beta RARB Retinoic acid receptor RXR-alpha/Retinoic acid receptor beta Retinoid receptor
Type:
PROTEIN
Mol. Mass.:
50498.70
Organism:
Homo sapiens (Human)
Description:
ChEMBL_1458015
Residue:
455
  
Inhibitor
Name:
BDBM50135463
Synonyms:
(2E,4E,6Z)-7-[2-(2,2-Difluoro-ethoxy)-5-isopropyl-biphenyl-3-yl]-3-methyl-octa-2,4,6-trienoic acid | CHEMBL424639
Type:
Small organic molecule
Emp. Form.:
C26H28F2O3
Mol. Mass.:
426.4955
SMILES:
CC(C)c1cc(\C(C)=C/C=C/C(/C)=C/C(O)=O)c(OCC(F)F)c(c1)-c1ccccc1
: