Target
Retinoic acid receptor alpha
Ligand
BDBM50135463
Substrate
Meas. Tech.
ChEBML_197251
Ki
4659±n/a nM
Citation
 Michellys, PYBoehm, MFChen, JHGrese, TAKaranewsky, DSLeibowitz, MDLiu, SMais, DAMapes, CMReifel-Miller, AOgilvie, KMRungta, DThompson, AWTyhonas, JSYumibe, NArdecky, RJ Design and synthesis of novel RXR-selective modulators with improved pharmacological profile. Bioorg Med Chem Lett 13:4071-5 (2003)  
Target
Name:
Retinoic acid receptor alpha
Synonyms:
NR1B1 RAR-alpha RARA_HUMAN Retinoic acid receptor alpha/Retinoid X receptor alpha Retinoid receptor
Type:
PROTEIN
Mol. Mass.:
50778.87
Organism:
Homo sapiens (Human)
Description:
ChEMBL_1466191
Residue:
462
  
Inhibitor
Name:
BDBM50135463
Synonyms:
(2E,4E,6Z)-7-[2-(2,2-Difluoro-ethoxy)-5-isopropyl-biphenyl-3-yl]-3-methyl-octa-2,4,6-trienoic acid | CHEMBL424639
Type:
Small organic molecule
Emp. Form.:
C26H28F2O3
Mol. Mass.:
426.4955
SMILES:
CC(C)c1cc(\C(C)=C/C=C/C(/C)=C/C(O)=O)c(OCC(F)F)c(c1)-c1ccccc1
: