Target
Carboxylic ester hydrolase
Ligand
BDBM50135653
Substrate
Meas. Tech.
ChEBML_41398
Ki
10±n/a nM
Citation
 Lin, GTsai, HJTsai, YH Cage amines as the stopper inhibitors of cholinesterases. Bioorg Med Chem Lett 13:2887-90 (2003)  
Target
Name:
Carboxylic ester hydrolase
Synonyms:
BuChE Butyrylcholine esterase Butyrylcholinesterase (BChE) Butyrylcholinesterase (EqBuChE) butyrylcholinesterase precursor
Type:
Protein
Mol. Mass.:
68842.83
Organism:
Equus caballus (Horse)
Description:
Q9N1N9
Residue:
602
  
Inhibitor
Name:
BDBM50135653
Synonyms:
2,4,6,8,10,12-hexa(2-chloro phenylmethyl)-2,4,6,8,10,12-hexaazatetracyclo[5.5.0.05,9.03,11]dodecane | CHEMBL319086
Type:
Small organic molecule
Emp. Form.:
C49H44Cl6N6
Mol. Mass.:
929.632
SMILES:
Clc1ccccc1CNC1C2N(Cc3ccccc3Cl)C3C(N(Cc4ccccc4Cl)C4(CC4N2Cc2ccccc2Cl)N3Cc2ccccc2Cl)N1Cc1ccccc1Cl
: