Target
Alpha-1A/Alpha-1B/Alpha-1D adrenergic receptor
Ligand
BDBM50005127
Substrate
Meas. Tech.
ChEMBL_2112625 (CHEMBL4821475)
Ki
229±n/a nM
Citation
 Ku?aga, DJa?kowska, JSata?a, G Radioligand and computational insight in structure - Activity relationship of saccharin derivatives being ipsapirone and revospirone analogues. Bioorg Med Chem Lett 42:0 (2021)  
Target
Name:
Alpha-1A/Alpha-1B/Alpha-1D adrenergic receptor
Synonyms:
Adrenergic receptor alpha-1
Type:
Mol. Mass.:
Description:
ASSAY_ID of ChEMBL is 306566
Components:
This complex has 3 components.
Component 1
Name:
Alpha-1D adrenergic receptor
Synonyms:
ADA1D_HUMAN ADRA1D Adrenergic receptor alpha Alpha 1D-adrenoreceptor Alpha-1D adrenoceptor adrenergic Alpha1D
Type:
Enzyme Catalytic Domain
Mol. Mass.:
60485.82
Organism:
Homo sapiens (Human)
Description:
adrenergic Alpha1D ADRA1D HUMAN::P25100
Residue:
572
  
Component 2
Name:
Alpha-1B adrenergic receptor
Synonyms:
ADA1B_HUMAN Adrenergic alpha1B Adrenergic receptor alpha Alpha 1B-adrenoreceptor | Alpha-1B adrenergic receptor
Type:
Enzyme
Mol. Mass.:
56862.13
Organism:
Homo sapiens (Human)
Description:
P35368
Residue:
520
  
Component 3
Name:
Alpha-1A adrenergic receptor
Synonyms:
ADA1A_HUMAN ADRA1C Alpha 1A-adrenoceptor Alpha adrenergic receptor 1a Alpha-adrenergic receptor 1c adrenergic Alpha1 | adrenergic Alpha1C
Type:
Cell-surface receptors
Mol. Mass.:
51511.67
Organism:
Homo sapiens (Human)
Description:
P35348
Residue:
466
  
Inhibitor
Name:
BDBM50005127
Synonyms:
1,1-Dioxo-2-[4-(4-pyrimidin-2-yl-piperazin-1-yl)-butyl]-1,2-dihydro-1lambda*6*-benzo[d]isothiazol-3-one 1,1-Dioxo-2-[4-(4-pyrimidin-2-yl-piperazin-1-yl)-butyl]-1,2-dihydro-1lambda*6*-benzo[d]isothiazol-3-one(Ipsapirone) IPSAPIRONE
Type:
Small organic molecule
Emp. Form.:
C19H23N5O3S
Mol. Mass.:
401.483
SMILES:
O=C1N(CCCCN2CCN(CC2)c2ncccn2)S(=O)(=O)c2ccccc12
: