Target
Misshapen-like kinase 1
Ligand
BDBM50571039
Substrate
Meas. Tech.
ChEMBL_2113643 (CHEMBL4822493)
IC50
91±n/a nM
Citation
 Qiu, HAli, ZBender, ACaldwell, RChen, YYFang, ZGardberg, AGlaser, NGoettsche, AGoutopoulos, AGrenningloh, RHanschke, BHead, JJohnson, TJones, CJones, RKulkarni, SMaurer, CMorandi, FNeagu, CPoetzsch, SPotnick, JSchmidt, RRoe, KViacava Follis, AWing, CZhu, XSherer, B Discovery of potent and selective reversible Bruton's tyrosine kinase inhibitors. Bioorg Med Chem 40:0 (2021)  
Target
Name:
Misshapen-like kinase 1
Synonyms:
B55 MAP4K6 MEK kinase kinase 6 MINK MINK1_HUMAN Misshapen/NIK-related kinase Voltage-gated potassium channel subunit Kv7.1/Misshapen-like kinase 1 ZC3
Type:
PROTEIN
Mol. Mass.:
149838.92
Organism:
Homo sapiens (Human)
Description:
ChEMBL_793919
Residue:
1332
  
Inhibitor
Name:
BDBM50571039
Synonyms:
CHEMBL4877846
Type:
Small organic molecule
Emp. Form.:
C32H38N8O2
Mol. Mass.:
566.6965
SMILES:
CC(C)n1nc(C)c(c1C)-c1nc2c(ccnc2[nH]1)-c1ccc2[C@@H](CCCCc2c1)NC(=O)c1nc(no1)C(C)(C)C
: