Target
Matrix metalloproteinase-15
Ligand
BDBM50137281
Substrate
Meas. Tech.
ChEBML_106795
IC50
29±n/a nM
Citation
 Ma, DWu, WYang, GLi, JLi, JYe, Q Tetrahydroisoquinoline based sulfonamide hydroxamates as potent matrix metalloproteinase inhibitors. Bioorg Med Chem Lett 14:47-50 (2003)  
Target
Name:
Matrix metalloproteinase-15
Synonyms:
MMP-15 MMP15_HUMAN MT2-MMP MTMMP2 Matrix metalloproteinase-15 Membrane-type-2 matrix metalloproteinase | SMCP-2
Type:
PROTEIN
Mol. Mass.:
75814.08
Organism:
Homo sapiens (Human)
Description:
ChEMBL_106793
Residue:
669
  
Inhibitor
Name:
BDBM50137281
Synonyms:
2-Benzenesulfonyl-6-hydroxy-7-methoxy-1,2,3,4-tetrahydro-isoquinoline-1-carboxylic acid hydroxyamide N,6-dihydroxy-7-methoxy-2-(phenylsulfonyl)-1,2,3,4-tetrahydroisoquinoline-1-carboxamide
Type:
Small organic molecule
Emp. Form.:
C17H18N2O6S
Mol. Mass.:
378.4
SMILES:
COc1cc2C(N(CCc2cc1O)S(=O)(=O)c1ccccc1)C(=O)NO
: