Target
Matrix metalloproteinase-16
Ligand
BDBM50137281
Substrate
Meas. Tech.
ChEBML_106799
IC50
40±n/a nM
Citation
 Ma, DWu, WYang, GLi, JLi, JYe, Q Tetrahydroisoquinoline based sulfonamide hydroxamates as potent matrix metalloproteinase inhibitors. Bioorg Med Chem Lett 14:47-50 (2003)  
Target
Name:
Matrix metalloproteinase-16
Synonyms:
C8orf57 MMP-X2 MMP16_HUMAN MT-MMP 3 MT3MMP Matrix metalloproteinase 16 Membrane-type matrix metalloproteinase 3 | Membrane-type-3 matrix metalloproteinase
Type:
PROTEIN
Mol. Mass.:
69536.76
Organism:
Homo sapiens (Human)
Description:
ChEMBL_799129
Residue:
607
  
Inhibitor
Name:
BDBM50137281
Synonyms:
2-Benzenesulfonyl-6-hydroxy-7-methoxy-1,2,3,4-tetrahydro-isoquinoline-1-carboxylic acid hydroxyamide N,6-dihydroxy-7-methoxy-2-(phenylsulfonyl)-1,2,3,4-tetrahydroisoquinoline-1-carboxamide
Type:
Small organic molecule
Emp. Form.:
C17H18N2O6S
Mol. Mass.:
378.4
SMILES:
COc1cc2C(N(CCc2cc1O)S(=O)(=O)c1ccccc1)C(=O)NO
: