Target
Interstitial collagenase
Ligand
BDBM50137281
Substrate
Meas. Tech.
ChEBML_106301
IC50
595±n/a nM
Citation
 Ma, DWu, WYang, GLi, JLi, JYe, Q Tetrahydroisoquinoline based sulfonamide hydroxamates as potent matrix metalloproteinase inhibitors. Bioorg Med Chem Lett 14:47-50 (2003)  
Target
Name:
Interstitial collagenase
Synonyms:
CLG MMP1 Matrix metalloproteinase-1 | Matrix metalloproteinase-1 (MMP-1)
Type:
Enzyme
Mol. Mass.:
54010.26
Organism:
Homo sapiens (Human)
Description:
P03956
Residue:
469
  
Inhibitor
Name:
BDBM50137281
Synonyms:
2-Benzenesulfonyl-6-hydroxy-7-methoxy-1,2,3,4-tetrahydro-isoquinoline-1-carboxylic acid hydroxyamide N,6-dihydroxy-7-methoxy-2-(phenylsulfonyl)-1,2,3,4-tetrahydroisoquinoline-1-carboxamide
Type:
Small organic molecule
Emp. Form.:
C17H18N2O6S
Mol. Mass.:
378.4
SMILES:
COc1cc2C(N(CCc2cc1O)S(=O)(=O)c1ccccc1)C(=O)NO
: