Target
Macrophage metalloelastase
Ligand
BDBM50137281
Substrate
Meas. Tech.
ChEBML_106462
IC50
65±n/a nM
Citation
 Ma, DWu, WYang, GLi, JLi, JYe, Q Tetrahydroisoquinoline based sulfonamide hydroxamates as potent matrix metalloproteinase inhibitors. Bioorg Med Chem Lett 14:47-50 (2003)  
Target
Name:
Macrophage metalloelastase
Synonyms:
HME MMP12_HUMAN Matrix metalloproteinase-12 (MMP 12) Matrix metalloproteinase-12 (MMP12) | Matrix metalloproteinases 12 (MMP-12)
Type:
Enzyme
Mol. Mass.:
54012.99
Organism:
Homo sapiens (Human)
Description:
P39900
Residue:
470
  
Inhibitor
Name:
BDBM50137281
Synonyms:
2-Benzenesulfonyl-6-hydroxy-7-methoxy-1,2,3,4-tetrahydro-isoquinoline-1-carboxylic acid hydroxyamide N,6-dihydroxy-7-methoxy-2-(phenylsulfonyl)-1,2,3,4-tetrahydroisoquinoline-1-carboxamide
Type:
Small organic molecule
Emp. Form.:
C17H18N2O6S
Mol. Mass.:
378.4
SMILES:
COc1cc2C(N(CCc2cc1O)S(=O)(=O)c1ccccc1)C(=O)NO
: