Target
72 kDa type IV collagenase
Ligand
BDBM50137281
Substrate
Meas. Tech.
ChEBML_104556
IC50
27±n/a nM
Citation
 Ma, DWu, WYang, GLi, JLi, JYe, Q Tetrahydroisoquinoline based sulfonamide hydroxamates as potent matrix metalloproteinase inhibitors. Bioorg Med Chem Lett 14:47-50 (2003)  
Target
Name:
72 kDa type IV collagenase
Synonyms:
72 kDa gelatinase CLG4A Gelatinase A (MMP-2) MMP2_HUMAN Matrix metalloproteinase-2 (MMP 2) Matrix metalloproteinases 2 (MMP-2) | TBE-1
Type:
Enzyme
Mol. Mass.:
73870.36
Organism:
Homo sapiens (Human)
Description:
P08253
Residue:
660
  
Inhibitor
Name:
BDBM50137281
Synonyms:
2-Benzenesulfonyl-6-hydroxy-7-methoxy-1,2,3,4-tetrahydro-isoquinoline-1-carboxylic acid hydroxyamide N,6-dihydroxy-7-methoxy-2-(phenylsulfonyl)-1,2,3,4-tetrahydroisoquinoline-1-carboxamide
Type:
Small organic molecule
Emp. Form.:
C17H18N2O6S
Mol. Mass.:
378.4
SMILES:
COc1cc2C(N(CCc2cc1O)S(=O)(=O)c1ccccc1)C(=O)NO
: