Target
Sodium/hydrogen exchanger 1
Ligand
BDBM50137546
Substrate
Meas. Tech.
ChEBML_202579
IC50
>30000±n/a nM
Citation
 Ahmad, SNgu, KCombs, DWWu, SCWeinstein, DSLiu, WChen, BCChandrasena, GDorso, CRKirby, MAtwal, KS Aminoimidazoles as bioisosteres of acylguanidines: novel, potent, selective and orally bioavailable inhibitors of the sodium hydrogen exchanger isoform-1. Bioorg Med Chem Lett 14:177-80 (2003)  
Target
Name:
Sodium/hydrogen exchanger 1
Synonyms:
APNH NHE-1 Na(+)/H(+) antiporter, amiloride-sensitive SL9A1_HUMAN Solute carrier family 9 member 1
Type:
PROTEIN
Mol. Mass.:
90771.96
Organism:
Homo sapiens (Human)
Description:
ChEMBL_862405
Residue:
815
  
Inhibitor
Name:
BDBM50137546
Synonyms:
5-[(1R,3R)-3-(2,3-Dihydro-benzofuran-4-yl)-2,2-dimethyl-cyclopropyl]-thiazol-2-ylamine | CHEMBL299442
Type:
Small organic molecule
Emp. Form.:
C16H18N2OS
Mol. Mass.:
286.392
SMILES:
CC1(C)[C@@H]([C@H]1c1cccc2OCCc12)c1cnc(N)s1
: