Target
L-lactate dehydrogenase A chain
Ligand
BDBM50572929
Substrate
Meas. Tech.
ChEMBL_2118568 (CHEMBL4827634)
IC50
0.500000±n/a nM
Citation
 Ding, JGumpena, RBoily, MOCaron, AChong, OCox, JHDumais, VGaudreault, SGraff, AHKing, AKnight, JOballa, RSurendradoss, JTang, TWu, JLowther, WTPowell, DA Dual Glycolate Oxidase/Lactate Dehydrogenase A Inhibitors for Primary Hyperoxaluria. ACS Med Chem Lett 12:1116-1123 (2021)  
Target
Name:
L-lactate dehydrogenase A chain
Synonyms:
Cell proliferation-inducing gene 19 protein L-lactate dehydrogenase A Chain LDH-A LDHA Lactate dehydrogenase A (LDHA) | Renal carcinoma antigen NY-REN-59
Type:
Protein
Mol. Mass.:
36694.85
Organism:
Homo sapiens (Human)
Description:
P00338::PDB Code: 4ajp
Residue:
332
  
Inhibitor
Name:
BDBM50572929
Synonyms:
CHEMBL4864519
Type:
Small organic molecule
Emp. Form.:
C27H22FN7O6S3
Mol. Mass.:
655.7
SMILES:
NS(=O)(=O)c1ccc(Cc2c(CC3CC3)n(nc2-c2cccc(Sc3[nH]nnc3C(O)=O)c2)-c2nc(cs2)C(O)=O)cc1F
: