Target
Bifunctional dihydrofolate reductase-thymidylate synthase
Ligand
BDBM50110760
Substrate
Meas. Tech.
ChEMBL_55403 (CHEMBL668412)
Ki
8.7±n/a nM
Citation
 Sirichaiwat, CIntaraudom, CKamchonwongpaisan, SVanichtanankul, JThebtaranonth, YYuthavong, Y Target guided synthesis of 5-benzyl-2,4-diamonopyrimidines: their antimalarial activities and binding affinities to wild type and mutant dihydrofolate reductases from Plasmodium falciparum. J Med Chem 47:345-54 (2004)  
Target
Name:
Bifunctional dihydrofolate reductase-thymidylate synthase
Synonyms:
DHFR-TS Dihydrofolate Reductase-Thymidylate Synthase (DHFR-TS) Mutant KICB1 PfDHFR-TS double mutant (C59R+S108N)
Type:
Enzyme
Mol. Mass.:
71822.51
Organism:
Plasmodium falciparum (isolate K1 / Thailand)
Description:
The mutant clone was prepared by cassette mutagenesis using wildtype pfDHFR as a template, and expressed in E. coli.
Residue:
608
  
Inhibitor
Name:
BDBM50110760
Synonyms:
5-(3-methoxy-4-(3,4,5-trimethoxybenzyloxy)benzyl)pyrimidine-2,4-diamine CHEMBL22811
Type:
Small organic molecule
Emp. Form.:
C22H26N4O5
Mol. Mass.:
426.4656
SMILES:
COc1cc(Cc2cnc(N)nc2N)ccc1OCc1cc(OC)c(OC)c(OC)c1
: