Target
Acetylcholinesterase
Ligand
BDBM50138754
Substrate
Meas. Tech.
ChEMBL_29411 (CHEMBL643384)
IC50
>50000±n/a nM
Citation
 Ebdrup, SSørensen, LGOlsen, OHJacobsen, P Synthesis and structure-activity relationship for a novel class of potent and selective carbamoyl-triazole based inhibitors of hormone sensitive lipase. J Med Chem 47:400-10 (2004)  
Target
Name:
Acetylcholinesterase
Synonyms:
ACES_HUMAN Acetylcholinesterase (AChE) | Acetylcholinesterase (human AChE)
Type:
Enzyme
Mol. Mass.:
67792.70
Organism:
Homo sapiens (Human)
Description:
P22303
Residue:
614
  
Inhibitor
Name:
BDBM50138754
Synonyms:
(3-(4-chlorophenyl)-5-(hexylthio)-1H-1,2,4-triazol-1-yl)(morpholino)methanone [3-(4-Chloro-phenyl)-5-hexylsulfanyl-[1,2,4]triazol-1-yl]-morpholin-4-yl-methanone
Type:
Small organic molecule
Emp. Form.:
C19H25ClN4O2S
Mol. Mass.:
408.945
SMILES:
CCCCCCSc1nc(nn1C(=O)N1CCOCC1)-c1ccc(Cl)cc1
: