Target
Cannabinoid receptor 2
Ligand
BDBM50138900
Substrate
Meas. Tech.
ChEMBL_46977 (CHEMBL659744)
Ki
>1000±n/a nM
Citation
 Lange, JHCoolen, HKvan Stuivenberg, HHDijksman, JAHerremans, AHRonken, EKeizer, HGTipker, KMcCreary, ACVeerman, WWals, HCStork, BVerveer, PCden Hartog, APde Jong, NMAdolfs, TJHoogendoorn, JKruse, CG Synthesis, biological properties, and molecular modeling investigations of novel 3,4-diarylpyrazolines as potent and selective CB(1) cannabinoid receptor antagonists. J Med Chem 47:627-43 (2004)  
Target
Name:
Cannabinoid receptor 2
Synonyms:
CANNABINOID CB2 CB2 CB2B CNR2_HUMAN Cannabinoid CB2 receptor Cannabinoid receptor 2 (CB2R) | hCB2
Type:
G Protein-Coupled Receptor (GPCR)
Mol. Mass.:
39690.94
Organism:
Homo sapiens (Human)
Description:
P34972
Residue:
360
  
Inhibitor
Name:
BDBM50138900
Synonyms:
CHEMBL157591 | N-[1-[3-(4-Chloro-phenyl)-4-phenyl-4,5-dihydro-pyrazol-1-yl]-1-methylamino-meth-(E)-ylidene]-3-trifluoromethyl-benzenesulfonamide
Type:
Small organic molecule
Emp. Form.:
C24H20ClF3N4O2S
Mol. Mass.:
520.954
SMILES:
CN=C(NS(=O)(=O)c1cccc(c1)C(F)(F)F)N1CC(C(=N1)c1ccc(Cl)cc1)c1ccccc1
: