Target
Cannabinoid receptor 1
Ligand
BDBM50138902
Substrate
Meas. Tech.
ChEMBL_46448 (CHEMBL657896)
Ki
16.1±n/a nM
Citation
 Lange, JHCoolen, HKvan Stuivenberg, HHDijksman, JAHerremans, AHRonken, EKeizer, HGTipker, KMcCreary, ACVeerman, WWals, HCStork, BVerveer, PCden Hartog, APde Jong, NMAdolfs, TJHoogendoorn, JKruse, CG Synthesis, biological properties, and molecular modeling investigations of novel 3,4-diarylpyrazolines as potent and selective CB(1) cannabinoid receptor antagonists. J Med Chem 47:627-43 (2004)  
Target
Name:
Cannabinoid receptor 1
Synonyms:
CANN6 CB-R CNR CNR1_HUMAN Cannabinoid receptor Cannabinoid receptor 1 (brain)
Type:
G Protein-Coupled Receptor (GPCR)
Mol. Mass.:
52868.96
Organism:
Homo sapiens (Human)
Description:
P21554
Residue:
472
  
Inhibitor
Name:
BDBM50138902
Synonyms:
CHEMBL160767 | N-[1-Amino-1-[3-(4-chloro-phenyl)-4-phenyl-4,5-dihydro-pyrazol-1-yl]-meth-(E)-ylidene]-4-chloro-benzenesulfonamide
Type:
Small organic molecule
Emp. Form.:
C22H18Cl2N4O2S
Mol. Mass.:
473.375
SMILES:
Clc1ccc(cc1)C1=NN(CC1c1ccccc1)C(=N)NS(=O)(=O)c1ccc(Cl)cc1
: