Target
Phosphatidylinositol 4,5-bisphosphate 3-kinase catalytic subunit delta isoform
Ligand
BDBM50573153
Substrate
Meas. Tech.
ChEMBL_2119126 (CHEMBL4828192)
IC50
0.000±n/a nM
Citation
 Down, KAmour, AAnderson, NABarton, NCampos, SCannons, EPClissold, CConvery, MACoward, JJDoyle, KDuempelfeld, BEdwards, CDGoldsmith, MDKrause, JMallett, DNMcGonagle, GAPatel, VKRowedder, JRowland, PSharpe, ASriskantharajah, SThomas, DAThomson, DWUddin, SHamblin, JNHessel, EM Discovery of GSK251: A Highly Potent, Highly Selective, Orally Bioavailable Inhibitor of PI3K? with a Novel Binding Mode. J Med Chem 64:13780-13792 (2021)  
Target
Name:
Phosphatidylinositol 4,5-bisphosphate 3-kinase catalytic subunit delta isoform
Synonyms:
PI3-kinase p110 subunit delta PI3-kinase subunit p110-delta PIK3CD Phosphatidylinositol 4,5-biphosphate 3-kinase catalytic subunit delta (PIK3CD) Phosphatidylinositol 4,5-bisphosphate 3-kinase 110 kDa catalytic subunit delta (PI3K delta) Phosphatidylinositol 4,5-bisphosphate 3-kinase catalytic subunit delta (PI3Kdelta) Phosphatidylinositol 4,5-bisphosphate 3-kinase catalytic subunit delta isoform (PI3K delta) Phosphatidylinositol 4,5-bisphosphate 3-kinase catalytic subunit delta isoform (PI3K-delta) Phosphatidylinositol 4,5-bisphosphate 3-kinase catalytic subunit delta isoform (PI3Kdelta)
Type:
Enzyme Subunit
Mol. Mass.:
119489.41
Organism:
Homo sapiens (Human)
Description:
O00329
Residue:
1044
  
Inhibitor
Name:
BDBM50573153
Synonyms:
CHEMBL4877995
Type:
Small organic molecule
Emp. Form.:
C22H28N4O4S
Mol. Mass.:
444.547
SMILES:
COc1ncc(cc1S(=O)(=O)Nc1cncc(c1)C1CC1CN(C)C)C1=CCOCC1
: