Target
Geranylgeranyl transferase type-1 subunit beta/Protein farnesyltransferase/geranylgeranyltransferase type-1 subunit alpha
Ligand
BDBM50101929
Substrate
Meas. Tech.
ChEMBL_71972 (CHEMBL684165)
IC50
301±n/a nM
Citation
 Dinsmore, CJZartman, CBBergman, JMAbrams, MTBuser, CACulberson, JCDavide, JPEllis-Hutchings, MFernandes, CGraham, SLHartman, GDHuber, HELobell, RBMosser, SDRobinson, RGWilliams, TM Macrocyclic piperazinones as potent dual inhibitors of farnesyltransferase and geranylgeranyltransferase-I. Bioorg Med Chem Lett 14:639-43 (2004)  
Target
Name:
Geranylgeranyl transferase type-1 subunit beta/Protein farnesyltransferase/geranylgeranyltransferase type-1 subunit alpha
Synonyms:
Geranylgeranyl transferase type I Geranylgeranyl transferase type I beta/Protein farnesyltransferase/geranylgeranyltransferase type I alpha subunit
Type:
Mol. Mass.:
Description:
ASSAY_ID of EBI is 70196
Components:
This complex has 2 components.
Component 1
Name:
Protein farnesyltransferase/geranylgeranyltransferase type-1 subunit alpha
Synonyms:
CAAX farnesyltransferase alpha subunit FNTA_HUMAN FTase-alpha Geranylgeranyl Transferase (GGTase-I) Chain A Protein Farnesyltransferase (PFT) Chain A Protein farnesyltransferase Protein farnesyltransferase/geranylgeranyltransferase type I alpha subunit | Ras proteins prenyltransferase alpha
Type:
Enzyme
Mol. Mass.:
44392.46
Organism:
Homo sapiens (Human)
Description:
Recombinant human FTase.
Residue:
379
  
Component 2
Name:
Geranylgeranyl transferase type-1 subunit beta
Synonyms:
2.5.1.59 Geranylgeranyl transferase type I Geranylgeranyl transferase type I subunit beta PGGT1B Protein farnesyl/geranylgeranyl transferase | Type I protein geranyl-geranyltransferase subunit beta
Type:
Mol. Mass.:
42369.84
Organism:
Homo sapiens (Human)
Description:
Residue:
377
  
Inhibitor
Name:
BDBM50101929
Synonyms:
3-oxo-18-oxa-2,5,9,11-tetraazahexacyclo[17.6.2.22,5.113,17.07,11.022,26]triaconta-1(26),7,9,13(30),14,16,19(27),20,22,24-decaen-16-yl cyanide 4-{5-[4-(3-Chloro-phenyl)-3-oxo-piperazin-1-ylmethyl]-imidazol-1-ylmethyl}-benzonitrile | CHEMBL52073
Type:
Small organic molecule
Emp. Form.:
C26H21N5O2
Mol. Mass.:
435.4772
SMILES:
O=C1CN2CCN1c1cccc3ccc(Oc4cc(Cn5cncc5C2)ccc4C#N)cc13
: