Target
Protein farnesyltransferase subunit beta/geranylgeranyltransferase type-1 subunit alpha
Ligand
BDBM50139580
Substrate
Meas. Tech.
ChEBML_68492
IC50
6±n/a nM
Citation
 Le Diguarher, TOrtuno, JCShanks, DGuilbaud, NPierré, ARaimbaud, EFauchère, JLHickman, JATucker, GCCasara, PJ Synthesis of N,N'-disubstituted 3-aminobenzo[c] and [d]azepin-2-ones as potent and specific farnesyl transferase inhibitors. Bioorg Med Chem Lett 14:767-71 (2004)  
Target
Name:
Protein farnesyltransferase subunit beta/geranylgeranyltransferase type-1 subunit alpha
Synonyms:
Farnesyltransferase (FTase) Protein Farnesyltransferase (PFT) Chain B | Protein farnesyltransferase
Type:
Protein Complex
Mol. Mass.:
Description:
To express recombinant enzyme in E. coli, the cloned human alpha and beta subunits were co-expressed from a plasmid, in which their expression was translationally coupled.
Components:
This complex has 2 components.
Component 1
Name:
Protein farnesyltransferase subunit beta
Synonyms:
CAAX farnesyltransferase subunit alpha FNTB FTase-alpha GGTase-I-alpha Protein farnesyl/geranylgeranyl transferase Protein farnesyltransferase subunit beta Protein farnesyltransferase/geranylgeranyltransferase type-1 subunit alpha Ras proteins prenyltransferase subunit beta | Type I protein geranyl-geranyltransferase subunit alpha
Type:
Enzyme Subunit
Mol. Mass.:
48766.02
Organism:
Homo sapiens (Human)
Description:
Protein farnesyltransferase subunit beta
Residue:
437
  
Component 2
Name:
Protein farnesyltransferase/geranylgeranyltransferase type-1 subunit alpha
Synonyms:
CAAX farnesyltransferase alpha subunit FNTA_HUMAN FTase-alpha Geranylgeranyl Transferase (GGTase-I) Chain A Protein Farnesyltransferase (PFT) Chain A Protein farnesyltransferase Protein farnesyltransferase/geranylgeranyltransferase type I alpha subunit | Ras proteins prenyltransferase alpha
Type:
Enzyme
Mol. Mass.:
44392.46
Organism:
Homo sapiens (Human)
Description:
Recombinant human FTase.
Residue:
379
  
Inhibitor
Name:
BDBM50139580
Synonyms:
4-(5-{[2-(3-Chloro-benzyl)-3-oxo-2,3,4,5-tetrahydro-1H-benzo[c]azepin-4-ylamino]-methyl}-imidazol-1-ylmethyl)-benzonitrile | CHEMBL351004
Type:
Small organic molecule
Emp. Form.:
C29H26ClN5O
Mol. Mass.:
496.003
SMILES:
Clc1cccc(CN2Cc3ccccc3CC(NCc3cncn3Cc3ccc(cc3)C#N)C2=O)c1
: