Target
Adenosine receptor A2a
Ligand
BDBM82025
Substrate
Meas. Tech.
ChEMBL_29997 (CHEMBL643008)
Ki
190±n/a nM
Citation
 Yan, LMüller, CE Preparation, properties, reactions, and adenosine receptor affinities of sulfophenylxanthine nitrophenyl esters: toward the development of sulfonic acid prodrugs with peroral bioavailability. J Med Chem 47:1031-43 (2004)  
Target
Name:
Adenosine receptor A2a
Synonyms:
AA2AR_RAT Adenosine A2 receptor Adenosine Receptors A2a (A2a) Adenosine receptors A2a Rat striatal adenosine A2a receptor
Type:
G Protein-Coupled Receptor (GPCR)
Mol. Mass.:
45015.65
Organism:
Rattus norvegicus (rat)
Description:
Rat A2A receptors expressed in CHO cells.
Residue:
410
  
Inhibitor
Name:
BDBM82025
Synonyms:
1,3-Dipropyl-8-phenylxanthine CAS_128784 NSC_128784
Type:
Small organic molecule
Emp. Form.:
C17H20N4O2
Mol. Mass.:
312.3663
SMILES:
CCCn1c2nc([nH]c2c(=O)n(CCC)c1=O)-c1ccccc1
: