Target
Carbonic anhydrase 2
Ligand
BDBM50574145
Substrate
Meas. Tech.
ChEMBL_2121942 (CHEMBL4831089)
Ki
3.1±n/a nM
Citation
 Tanini, DCarradori, SCapperucci, ALupori, LZara, SFerraroni, MGhelardini, CMannelli, LMicheli, LLucarini, ECarta, FAngeli, ASupuran, CT Chalcogenides-incorporating carbonic anhydrase inhibitors concomitantly reverted oxaliplatin-induced neuropathy and enhanced antiproliferative action. Eur J Med Chem 225:0 (2021)  
Target
Name:
Carbonic anhydrase 2
Synonyms:
CA-II CAC Carbonate dehydratase II Carbonic anhydrase 2 (CA-II) Carbonic anhydrase C Carbonic anhydrase II (CA-II) Carbonic anhydrase II (hCA II) | Carbonic anhydrase isoenzyme II (hCA II)
Type:
Enzyme
Mol. Mass.:
29250.71
Organism:
Homo sapiens (Human)
Description:
P00918
Residue:
260
  
Inhibitor
Name:
BDBM50574145
Synonyms:
CHEMBL4849345
Type:
Small organic molecule
Emp. Form.:
C15H17NO3S2Se
Mol. Mass.:
402.39
SMILES:
[#7]S(=O)(=O)c1ccc([Se;v2][#6]-[#6](-[#8])-[#6]-[#16]-c2ccccc2)cc1
: