Target
Ileal sodium/bile acid cotransporter
Ligand
BDBM50140283
Substrate
Meas. Tech.
ChEBML_28895
IC50
>63000±n/a nM
Citation
 Kurata, HSuzuki, SOhhata, YIkeda, THasegawa, TKitayama, KInaba, TKono, KKohama, T A novel class of apical sodium-dependent bile acid transporter inhibitors: the amphiphilic 4-oxo-1-phenyl-1,4-dihydroquinoline derivatives. Bioorg Med Chem Lett 14:1183-6 (2004)  
Target
Name:
Ileal sodium/bile acid cotransporter
Synonyms:
ASBT IBAT Ileal Na(+)/bile acid cotransporter Ileal bile acid transporter/bile acid cotransporter NTCP2 SLC10A2
Type:
Enzyme
Mol. Mass.:
37714.89
Organism:
Homo sapiens (Human)
Description:
SLC10A2
Residue:
348
  
Inhibitor
Name:
BDBM50140283
Synonyms:
(4R,5R)-3,3-Dibutyl-7-dimethylamino-5-(4-methoxy-phenyl)-1,1-dioxo-2,3,4,5-tetrahydro-1H-1lambda*6*-benzo[b]thiepin-4-ol | CHEMBL18219
Type:
Small organic molecule
Emp. Form.:
C27H39NO4S
Mol. Mass.:
473.668
SMILES:
CCCCC1(CCCC)CS(=O)(=O)c2ccc(cc2[C@H]([C@H]1O)c1ccc(OC)cc1)N(C)C
: