Target
Ileal sodium/bile acid cotransporter
Ligand
BDBM50085476
Substrate
Meas. Tech.
ChEBML_28895
IC50
>185000±n/a nM
Citation
 Kurata, HSuzuki, SOhhata, YIkeda, THasegawa, TKitayama, KInaba, TKono, KKohama, T A novel class of apical sodium-dependent bile acid transporter inhibitors: the amphiphilic 4-oxo-1-phenyl-1,4-dihydroquinoline derivatives. Bioorg Med Chem Lett 14:1183-6 (2004)  
Target
Name:
Ileal sodium/bile acid cotransporter
Synonyms:
ASBT IBAT Ileal Na(+)/bile acid cotransporter Ileal bile acid transporter/bile acid cotransporter NTCP2 SLC10A2
Type:
Enzyme
Mol. Mass.:
37714.89
Organism:
Homo sapiens (Human)
Description:
SLC10A2
Residue:
348
  
Inhibitor
Name:
BDBM50085476
Synonyms:
1-(3,4-Dimethoxy-phenyl)-3-(3-ethyl-pentanoyl)-4-hydroxy-6,7,8-trimethoxy-naphthalene-2-carboxylic acid methyl ester S-8921
Type:
Small organic molecule
Emp. Form.:
C30H36O9
Mol. Mass.:
540.6014
SMILES:
CCC(CC)CC(=O)c1c(O)c2cc(OC)c(OC)c(OC)c2c(-c2ccc(OC)c(OC)c2)c1C(=O)OC
: