Target
Coagulation factor X
Ligand
BDBM50140388
Substrate
Meas. Tech.
ChEMBL_48792 (CHEMBL662445)
Ki
0.500000±n/a nM
Citation
 Jia, ZJWu, YHuang, WZhang, PClizbe, LAGoldman, EASinha, UArfsten, AEEdwards, STAlphonso, MHutchaleelaha, AScarborough, RMZhu, BY 1-(2-Naphthyl)-1H-pyrazole-5-carboxylamides as potent factor Xa inhibitors. Part 2: A survey of P4 motifs. Bioorg Med Chem Lett 14:1221-7 (2004)  
Target
Name:
Coagulation factor X
Synonyms:
Activated coagulation factor X (FXa) Coagulation factor X precursor F10 Factor X heavy chain Factor Xa Stuart-Prower factor
Type:
Enzyme
Mol. Mass.:
54726.60
Organism:
Homo sapiens (Human)
Description:
Residue:
488
  
Inhibitor
Name:
BDBM50140388
Synonyms:
2-(6-Chloro-naphthalen-2-yl)-5-methyl-2H-pyrazole-3-carboxylic acid [2-fluoro-4-(3-oxo-morpholin-4-yl)-phenyl]-amide | CHEMBL20714
Type:
Small organic molecule
Emp. Form.:
C25H20ClFN4O3
Mol. Mass.:
478.903
SMILES:
Cc1cc(C(=O)Nc2ccc(cc2F)N2CCOCC2=O)n(n1)-c1ccc2cc(Cl)ccc2c1
: