Target
Monoglyceride lipase
Ligand
BDBM50574645
Substrate
Meas. Tech.
ChEMBL_2122937 (CHEMBL4832170)
IC50
21±n/a nM
Citation
 Bononi, GTonarini, GPoli, GBarravecchia, ICaligiuri, IMacchia, MRizzolio, FDemontis, GCMinutolo, FGranchi, CTuccinardi, T Monoacylglycerol lipase (MAGL) inhibitors based on a diphenylsulfide-benzoylpiperidine scaffold. Eur J Med Chem 223:0 (2021)  
Target
Name:
Monoglyceride lipase
Synonyms:
HU-K5 Lysophospholipase-like MGL MGLL_HUMAN
Type:
Hydrolase
Mol. Mass.:
33264.56
Organism:
Homo sapiens (Human)
Description:
Human recombinant MGL (Cayman Chemical, cat# 10008354).
Residue:
303
  
Inhibitor
Name:
BDBM50574645
Synonyms:
CHEMBL4870413
Type:
Small organic molecule
Emp. Form.:
C26H22F3NO4S
Mol. Mass.:
501.517
SMILES:
Oc1cccc(c1)C(=O)N1CCC(CC1)C(=O)c1ccc(Sc2ccc(OC(F)(F)F)cc2)cc1
: