Target
Monoglyceride lipase
Ligand
BDBM50574653
Substrate
Meas. Tech.
ChEMBL_2122937 (CHEMBL4832170)
IC50
26±n/a nM
Citation
 Bononi, GTonarini, GPoli, GBarravecchia, ICaligiuri, IMacchia, MRizzolio, FDemontis, GCMinutolo, FGranchi, CTuccinardi, T Monoacylglycerol lipase (MAGL) inhibitors based on a diphenylsulfide-benzoylpiperidine scaffold. Eur J Med Chem 223:0 (2021)  
Target
Name:
Monoglyceride lipase
Synonyms:
HU-K5 Lysophospholipase-like MGL MGLL_HUMAN
Type:
Hydrolase
Mol. Mass.:
33264.56
Organism:
Homo sapiens (Human)
Description:
Human recombinant MGL (Cayman Chemical, cat# 10008354).
Residue:
303
  
Inhibitor
Name:
BDBM50574653
Synonyms:
CHEMBL4857833
Type:
Small organic molecule
Emp. Form.:
C26H25NO3S
Mol. Mass.:
431.547
SMILES:
Cc1ccc(Sc2ccc(cc2)C(=O)C2CCN(CC2)C(=O)c2cccc(O)c2)cc1
: