Target
Substance-P receptor
Ligand
BDBM50140773
Substrate
Meas. Tech.
ChEMBL_205578 (CHEMBL812542)
IC50
0.01±n/a nM
Citation
 Cappelli, AGiuliani, GPericot Mohr Gl, GGallelli, AAnzini, MVomero, SCupello, AScarrone, SMatarrese, MMoresco, RMFazio, FFinetti, FMorbidelli, LZiche, M A non-peptide NK1 receptor agonist showing subpicomolar affinity. J Med Chem 47:1315-8 (2004)  
Target
Name:
Substance-P receptor
Synonyms:
NK-1 receptor NK1 Receptor NK1R_HUMAN Neurokinin-1 (NK-1) SPR TACR1 Tachykinin receptor 1 (NK1) | tachykinin
Type:
G Protein-Coupled Receptor (GPCR)
Mol. Mass.:
46254.43
Organism:
Homo sapiens (Human)
Description:
P25103
Residue:
407
  
Inhibitor
Name:
BDBM50140773
Synonyms:
2-Bromomethyl-4-phenyl-quinoline-3-carboxylic acid 3,5-bis-trifluoromethyl-benzylamide | CHEMBL281797
Type:
Small organic molecule
Emp. Form.:
C26H17BrF6N2O
Mol. Mass.:
567.32
SMILES:
FC(F)(F)c1cc(CNC(=O)c2c(CBr)nc3ccccc3c2-c2ccccc2)cc(c1)C(F)(F)F
: