Target
Nitric oxide synthase, endothelial
Ligand
BDBM50141089
Substrate
Meas. Tech.
ChEMBL_65158 (CHEMBL678359)
IC50
785±n/a nM
Citation
 Lowe, JAQian, WDrozda, SEVolkmann, RANason, DNelson, RBNolan, CListon, DWard, KFaraci, SVerdries, KSeymour, PMajchrzak, MVillalobos, AWhite, WF Structure-activity relationships of potent, selective inhibitors of neuronal nitric oxide synthase based on the 6-phenyl-2-aminopyridine structure. J Med Chem 47:1575-86 (2004)  
Target
Name:
Nitric oxide synthase, endothelial
Synonyms:
Constitutive NOS Endothelial NOS NOS type III NOS3_HUMAN Nitric oxide synthase (inducible and endothelial) Nitric-oxide synthase (endothelial and brain) eNOS
Type:
Enzyme Catalytic Domain
Mol. Mass.:
133297.84
Organism:
Homo sapiens (Human)
Description:
P29474
Residue:
1203
  
Inhibitor
Name:
BDBM50141089
Synonyms:
6-[7-(2-Pyrrolidin-1-yl-ethoxy)-indan-4-yl]-pyridin-2-ylamine | CHEMBL290476
Type:
Small organic molecule
Emp. Form.:
C20H25N3O
Mol. Mass.:
323.432
SMILES:
Nc1cccc(n1)-c1ccc(OCCN2CCCC2)c2CCCc12
: