Target
Dual specificity mitogen-activated protein kinase kinase 1
Ligand
BDBM50141419
Substrate
Meas. Tech.
ChEBML_124012
IC50
40±n/a nM
Citation
 Wityak, JHobbs, FWGardner, DSSantella, JBPetraitis, JJSun, JHFavata, MFDaulerio, AJHoriuchi, KYCopeland, RAScherle, PAJaffe, BDTrzaskos, JMMagolda, RLTrainor, GLDuncia, JV Beyond U0126. Dianion chemistry leading to the rapid synthesis of a series of potent MEK inhibitors. Bioorg Med Chem Lett 14:1483-6 (2004)  
Target
Name:
Dual specificity mitogen-activated protein kinase kinase 1
Synonyms:
Dual specificity mitogen-activated protein kinase (MEK) Dual specificity mitogen-activated protein kinase kinase 1 (MEK1) Dual specificity mitogen-activated protein kinase kinase MEK1/2 MAP kinase kinase 1 MAPK/ERK kinase 1 MEK-1 MP2K1_HUMAN PRKMK1 | VHL-MAP2K1/MAP2K2
Type:
Other Protein Type
Mol. Mass.:
43439.03
Organism:
Homo sapiens (Human)
Description:
Full-length human MEK-1 was generated by PCR and purified as a fusion protein from Escherichia coli lysates.
Residue:
393
  
Inhibitor
Name:
BDBM50141419
Synonyms:
(Z)-3-Amino-3-(2-amino-phenylsulfanyl)-2-(3-phenoxy-phenyl)-acrylonitrile | CHEMBL37504
Type:
Small organic molecule
Emp. Form.:
C21H17N3OS
Mol. Mass.:
359.444
SMILES:
Nc1ccccc1SC(=N)C(C#N)c1cccc(Oc2ccccc2)c1
: