Target
Melatonin receptor type 1B
Ligand
BDBM463444
Substrate
Meas. Tech.
ChEMBL_2125496 (CHEMBL4834841)
EC50
0.270000±n/a nM
Citation
 Ferreira, MAAzevedo, HMascarello, ASegretti, NDRusso, ERusso, VGuimarães, CRW Discovery of  J Med Chem 64:1904-1929 (2021)  
Target
Name:
Melatonin receptor type 1B
Synonyms:
MTNR1B Mel-1B-R Melatonin 1B Melatonin receptor type 1B | Melatonin receptor type 2 (MT2)
Type:
Enzyme
Mol. Mass.:
40203.54
Organism:
Homo sapiens (Human)
Description:
P49286
Residue:
362
  
Inhibitor
Name:
BDBM463444
Synonyms:
US10781182, Compound IA2-121 | US11091445, Compound code IA2-121
Type:
Small organic molecule
Emp. Form.:
C14H18ClN3O3
Mol. Mass.:
311.764
SMILES:
CCOc1nc2cc(Cl)c(OC)cc2n1CCNC(C)=O
: