Target
Coagulation factor X
Ligand
BDBM50142139
Substrate
Meas. Tech.
ChEMBL_48808 (CHEMBL872477)
Ki
0.100000±n/a nM
Citation
 Zhang, PBao, LZuckett, JFJia, ZJWoolfrey, JArfsten, AEdwards, SSinha, UHutchaleelaha, ALambing, JLHollenbach, SJScarborough, RMZhu, BY Design, synthesis, and SAR of anthranilamide-based factor Xa inhibitors with improved functional activity. Bioorg Med Chem Lett 14:989-93 (2004)  
Target
Name:
Coagulation factor X
Synonyms:
Activated coagulation factor X (FXa) Coagulation factor X precursor F10 Factor X heavy chain Factor Xa Stuart-Prower factor
Type:
Enzyme
Mol. Mass.:
54726.60
Organism:
Homo sapiens (Human)
Description:
Residue:
488
  
Inhibitor
Name:
BDBM50142139
Synonyms:
5-Chloro-N-(5-chloro-pyridin-2-yl)-2-{4-[(N-methyl-guanidino)-methyl]-benzoylamino}-benzamide | CHEMBL174558
Type:
Small organic molecule
Emp. Form.:
C22H20Cl2N6O2
Mol. Mass.:
471.339
SMILES:
CN(Cc1ccc(cc1)C(=O)Nc1ccc(Cl)cc1C(=O)Nc1ccc(Cl)cn1)C(N)=N
: