Target
Coagulation factor X
Ligand
BDBM50142158
Substrate
Meas. Tech.
ChEMBL_48808 (CHEMBL872477)
Ki
0.500000±n/a nM
Citation
 Zhang, PBao, LZuckett, JFJia, ZJWoolfrey, JArfsten, AEdwards, SSinha, UHutchaleelaha, ALambing, JLHollenbach, SJScarborough, RMZhu, BY Design, synthesis, and SAR of anthranilamide-based factor Xa inhibitors with improved functional activity. Bioorg Med Chem Lett 14:989-93 (2004)  
Target
Name:
Coagulation factor X
Synonyms:
Activated coagulation factor X (FXa) Coagulation factor X precursor F10 Factor X heavy chain Factor Xa Stuart-Prower factor
Type:
Enzyme
Mol. Mass.:
54726.60
Organism:
Homo sapiens (Human)
Description:
Residue:
488
  
Inhibitor
Name:
BDBM50142158
Synonyms:
5-Chloro-N-(5-chloro-pyridin-2-yl)-2-[4-(2-imino-imidazolidin-1-ylmethyl)-benzoylamino]-benzamide CHEMBL172360
Type:
Small organic molecule
Emp. Form.:
C23H20Cl2N6O2
Mol. Mass.:
483.35
SMILES:
NC1=NCCN1Cc1ccc(cc1)C(=O)Nc1ccc(Cl)cc1C(=O)Nc1ccc(Cl)cn1
: