Target
5-hydroxytryptamine receptor 2A
Ligand
BDBM50115071
Substrate
Meas. Tech.
ChEBML_2453
Ki
224±n/a nM
Citation
 Varnes, JGGardner, DSSantella, JBDuncia, JVEstrella, MWatson, PSClark, CMKo, SSWelch, PCovington, MStowell, NWadman, EDavies, PSolomon, KNewton, RCTrainor, GLDecicco, CPWacker, DA Discovery of N-propylurea 3-benzylpiperidines as selective CC chemokine receptor-3 (CCR3) antagonists. Bioorg Med Chem Lett 14:1645-9 (2004)  
Target
Name:
5-hydroxytryptamine receptor 2A
Synonyms:
5-HT-2 5-HT2A 5-hydroxytryptamine receptor 2A (5HT-2A) 5HT2A_HUMAN HTR2A | Serotonin receptor 2A
Type:
undefined
Mol. Mass.:
52607.65
Organism:
Homo sapiens (Human)
Description:
P28223
Residue:
471
  
Inhibitor
Name:
BDBM50115071
Synonyms:
1-{3-[4-(4-Fluoro-benzyl)-piperidin-1-yl]-propyl}-3-(3-methoxy-phenyl)-urea | CHEMBL42388
Type:
Small organic molecule
Emp. Form.:
C23H30FN3O2
Mol. Mass.:
399.5016
SMILES:
COc1cccc(NC(=O)NCCCN2CCC(Cc3ccc(F)cc3)CC2)c1
: