Target
Cannabinoid receptor 1
Ligand
BDBM66782
Substrate
Meas. Tech.
ChEMBL_2127082 (CHEMBL4836427)
IC50
1585±n/a nM
Citation
 Nguyen, TGamage, TFDecker, AMFinlay, DBLangston, TLBarrus, DGlass, MHarris, DLZhang, Y Rational design of cannabinoid type-1 receptor allosteric modulators: Org27569 and PSNCBAM-1 hybrids. Bioorg Med Chem 41:0 (2021)  
Target
Name:
Cannabinoid receptor 1
Synonyms:
CANN6 CB-R CNR CNR1_HUMAN Cannabinoid receptor Cannabinoid receptor 1 (brain)
Type:
G Protein-Coupled Receptor (GPCR)
Mol. Mass.:
52868.96
Organism:
Homo sapiens (Human)
Description:
P21554
Residue:
472
  
Inhibitor
Name:
BDBM66782
Synonyms:
1-(4-chlorophenyl)-3-[2-(4-methyl-1-piperazinyl)ethyl]urea 1-(4-chlorophenyl)-3-[2-(4-methylpiperazino)ethyl]urea N-(4-chlorophenyl)-N'-[2-(4-methylpiperazin-1-yl)ethyl]urea cid_22430294
Type:
Small organic molecule
Emp. Form.:
C14H21ClN4O
Mol. Mass.:
296.796
SMILES:
CN1CCN(CCNC(=O)Nc2ccc(Cl)cc2)CC1
: