Target
N-acetylated-alpha-linked acidic dipeptidase 2
Ligand
BDBM50143066
Substrate
Meas. Tech.
ChEMBL_71707 (CHEMBL680921)
Ki
14.4±n/a nM
Citation
 Kozikowski, APZhang, JNan, FPetukhov, PAGrajkowska, EWroblewski, JTYamamoto, TBzdega, TWroblewska, BNeale, JH Synthesis of urea-based inhibitors as active site probes of glutamate carboxypeptidase II: efficacy as analgesic agents. J Med Chem 47:1729-38 (2004)  
Target
Name:
N-acetylated-alpha-linked acidic dipeptidase 2
Synonyms:
N-acetylated-alpha-linked acidic dipeptidase 2 NAALAD2 NALD2_HUMAN
Type:
PROTEIN
Mol. Mass.:
83602.57
Organism:
Homo sapiens (Human)
Description:
ChEMBL_71707
Residue:
740
  
Inhibitor
Name:
BDBM50143066
Synonyms:
(2S,5S)-2-[3-((S)-3-Carboxy-1-carboxy-propyl)-ureido]-4-methyl-pentanedioic acid | CHEMBL416650
Type:
Small organic molecule
Emp. Form.:
C12H18N2O9
Mol. Mass.:
334.2793
SMILES:
C[C@@H](C[C@H](NC(=O)N[C@@H](CCC(O)=O)C(O)=O)C(O)=O)C(O)=O
: