Target
N-acetylated-alpha-linked acidic dipeptidase 2
Ligand
BDBM50143070
Substrate
Meas. Tech.
ChEMBL_71707 (CHEMBL680921)
Ki
5.3±n/a nM
Citation
 Kozikowski, APZhang, JNan, FPetukhov, PAGrajkowska, EWroblewski, JTYamamoto, TBzdega, TWroblewska, BNeale, JH Synthesis of urea-based inhibitors as active site probes of glutamate carboxypeptidase II: efficacy as analgesic agents. J Med Chem 47:1729-38 (2004)  
Target
Name:
N-acetylated-alpha-linked acidic dipeptidase 2
Synonyms:
N-acetylated-alpha-linked acidic dipeptidase 2 NAALAD2 NALD2_HUMAN
Type:
PROTEIN
Mol. Mass.:
83602.57
Organism:
Homo sapiens (Human)
Description:
ChEMBL_71707
Residue:
740
  
Inhibitor
Name:
BDBM50143070
Synonyms:
(S)-2-(3-{(S)-1-Carboxy-3-[1-(2-cyano-ethyl)-1H-tetrazol-5-yl]-propyl}-ureido)-pentanedioic acid | CHEMBL47058
Type:
Small organic molecule
Emp. Form.:
C14H19N7O7
Mol. Mass.:
397.3434
SMILES:
OC(=O)CC[C@H](NC(=O)N[C@@H](CCc1nnnn1CCC#N)C(O)=O)C(O)=O
: