Target
N-acetylated-alpha-linked acidic dipeptidase 2
Ligand
BDBM50398814
Substrate
Meas. Tech.
ChEMBL_71707 (CHEMBL680921)
Ki
1285±n/a nM
Citation
 Kozikowski, APZhang, JNan, FPetukhov, PAGrajkowska, EWroblewski, JTYamamoto, TBzdega, TWroblewska, BNeale, JH Synthesis of urea-based inhibitors as active site probes of glutamate carboxypeptidase II: efficacy as analgesic agents. J Med Chem 47:1729-38 (2004)  
Target
Name:
N-acetylated-alpha-linked acidic dipeptidase 2
Synonyms:
N-acetylated-alpha-linked acidic dipeptidase 2 NAALAD2 NALD2_HUMAN
Type:
PROTEIN
Mol. Mass.:
83602.57
Organism:
Homo sapiens (Human)
Description:
ChEMBL_71707
Residue:
740
  
Inhibitor
Name:
BDBM50398814
Synonyms:
CHEMBL2115435
Type:
Small organic molecule
Emp. Form.:
C13H20N2O9
Mol. Mass.:
348.3059
SMILES:
C[C@H](C[C@H](NC(=O)N[C@@H](C[C@@H](C)C(O)=O)C(O)=O)C(O)=O)C(O)=O
: