Target
NAD-dependent protein deacetylase sirtuin-2
Ligand
BDBM50576709
Substrate
Meas. Tech.
ChEMBL_2127690 (CHEMBL4837035)
Ki
7000±n/a nM
Citation
 Zhou, YShen, WPeng, JDeng, YLi, X Identification of isoform/domain-selective fragments from the selection of DNA-encoded dynamic library. Bioorg Med Chem 45:0 (2021)  
Target
Name:
NAD-dependent protein deacetylase sirtuin-2
Synonyms:
NAD-Dependent Deacetylase Sirtuin-2 NAD-dependent deacetylase sirtuin 3 SIR2-like SIR2L SIR2_HUMAN Sirtuin 2 (SIRT2)
Type:
Hydrolase
Mol. Mass.:
43172.62
Organism:
Homo sapiens (Human)
Description:
Residue:
389
  
Inhibitor
Name:
BDBM50576709
Synonyms:
CHEMBL4847877
Type:
Small organic molecule
Emp. Form.:
C36H45FN8O8
Mol. Mass.:
736.7897
SMILES:
CC1COc2c(N3CCN(C)CC3)c(F)cc3c2n1cc(C(=O)NCCOCCOCCOCCNC(=O)CCc1nc(no1)-c1ccncc1)c3=O
: